Target
Matrix metalloproteinase-9
Ligand
BDBM50171860
Substrate
Meas. Tech.
ChEMBL_307381 (CHEMBL835395)
Ki
5±n/a nM
Citation
 Khandelwal, ALukacova, VComez, DKroll, DMRaha, SBalaz, S A combination of docking, QM/MM methods, and MD simulation for binding affinity estimation of metalloprotein ligands. J Med Chem 48:5437-47 (2005)  
Target
Name:
Matrix metalloproteinase-9
Synonyms:
67 kDa matrix metalloproteinase-9 92 kDa gelatinase CLG4B Gelatinase B MMP9 Matrix metalloproteinase 9 (MMP-9) Matrix metalloproteinase-9 (MMP9)
Type:
Enzyme
Mol. Mass.:
78452.28
Organism:
Homo sapiens (Human)
Description:
P14780
Residue:
707
  
Inhibitor
Name:
BDBM50171860
Synonyms:
((R)-3-Hydroxycarbamoyl-3,4-dihydro-1H-isoquinolin-2-yl)-(4-methoxy-phenyl)-phosphinic acid ethyl ester | CHEMBL363424
Type:
Small organic molecule
Emp. Form.:
C19H23N2O5P
Mol. Mass.:
390.3701
SMILES:
CCOP(=O)(N1Cc2ccccc2C[C@@H]1C(=O)NO)c1ccc(OC)cc1
: