Target
Aldo-keto reductase family 1 member B1
Ligand
BDBM50089423
Substrate
Meas. Tech.
ChEMBL_305465 (CHEMBL831075)
IC50
570.0±n/a nM
Citation
 El-Kabbani, OCarbone, VDarmanin, COka, MMitschler, APodjarny, ASchulze-Briese, CChung, RP Structure of aldehyde reductase holoenzyme in complex with the potent aldose reductase inhibitor fidarestat: implications for inhibitor binding and selectivity. J Med Chem 48:5536-42 (2005)  
Target
Name:
Aldo-keto reductase family 1 member B1
Synonyms:
ALDR_RAT Akr1b4 Aldr1
Type:
PROTEIN
Mol. Mass.:
35797.87
Organism:
Rattus norvegicus
Description:
ChEMBL_1512484
Residue:
316
  
Inhibitor
Name:
BDBM50089423
Synonyms:
(2R,4S)-2-AMINOFORMYL-6-FLUORO-SPIRO[CHROMAN-4,4'-IMIDAZOLIDINE]-2',5'-DIONE 6-fluoro-2'',5''-dioxo-(2R,4''S)-spiro[3,4-dihydro-2H-chromene-4,4''-(1''H,2''H-imidazole)]-2-carboxamide CHEMBL84060
Type:
Small organic molecule
Emp. Form.:
C12H10FN3O4
Mol. Mass.:
279.2239
SMILES:
NC(=O)[C@H]1C[C@]2(NC(=O)NC2=O)c2cc(F)ccc2O1
: