Target
Liver carboxylesterase 1
Ligand
BDBM50171921
Substrate
Meas. Tech.
ChEMBL_303802 (CHEMBL829851)
Ki
365±n/a nM
Citation
 Hyatt, JLStacy, VWadkins, RMYoon, KJWierdl, MEdwards, CCZeller, MHunter, ADDanks, MKCrundwell, GPotter, PM Inhibition of carboxylesterases by benzil (diphenylethane-1,2-dione) and heterocyclic analogues is dependent upon the aromaticity of the ring and the flexibility of the dione moiety. J Med Chem 48:5543-50 (2005)  
Target
Name:
Liver carboxylesterase 1
Synonyms:
Acyl coenzyme A:cholesterol acyltransferase CES1 EST1_HUMAN Serine hydrolase (CES1)
Type:
Protein
Mol. Mass.:
62520.83
Organism:
Homo sapiens (Human)
Description:
Residue:
567
  
Inhibitor
Name:
BDBM50171921
Synonyms:
1,2-Di-thiophen-3-yl-ethane-1,2-dione CHEMBL372716
Type:
Small organic molecule
Emp. Form.:
C10H6O2S2
Mol. Mass.:
222.283
SMILES:
O=C(C(=O)c1ccsc1)c1ccsc1
: