Target
Acetylcholinesterase
Ligand
BDBM50171922
Substrate
Meas. Tech.
ChEMBL_303485 (CHEMBL838859)
Ki
>100000±n/a nM
Citation
 Hyatt, JLStacy, VWadkins, RMYoon, KJWierdl, MEdwards, CCZeller, MHunter, ADDanks, MKCrundwell, GPotter, PM Inhibition of carboxylesterases by benzil (diphenylethane-1,2-dione) and heterocyclic analogues is dependent upon the aromaticity of the ring and the flexibility of the dione moiety. J Med Chem 48:5543-50 (2005)  
Target
Name:
Acetylcholinesterase
Synonyms:
ACES_HUMAN Acetylcholinesterase (AChE) | Acetylcholinesterase (human AChE)
Type:
Enzyme
Mol. Mass.:
67792.70
Organism:
Homo sapiens (Human)
Description:
P22303
Residue:
614
  
Inhibitor
Name:
BDBM50171922
Synonyms:
1,2-Di-thiophen-2-yl-ethane-1,2-dione CHEMBL365445
Type:
Small organic molecule
Emp. Form.:
C10H6O2S2
Mol. Mass.:
222.283
SMILES:
O=C(C(=O)c1cccs1)c1cccs1
: