Target
Cocaine esterase
Ligand
BDBM50171921
Substrate
Meas. Tech.
ChEMBL_303811 (CHEMBL827070)
Ki
6540±n/a nM
Citation
 Hyatt, JLStacy, VWadkins, RMYoon, KJWierdl, MEdwards, CCZeller, MHunter, ADDanks, MKCrundwell, GPotter, PM Inhibition of carboxylesterases by benzil (diphenylethane-1,2-dione) and heterocyclic analogues is dependent upon the aromaticity of the ring and the flexibility of the dione moiety. J Med Chem 48:5543-50 (2005)  
Target
Name:
Cocaine esterase
Synonyms:
CES2 EST2_HUMAN | ICE
Type:
PROTEIN
Mol. Mass.:
61801.08
Organism:
Homo sapiens (Human)
Description:
ChEMBL_1494240
Residue:
559
  
Inhibitor
Name:
BDBM50171921
Synonyms:
1,2-Di-thiophen-3-yl-ethane-1,2-dione CHEMBL372716
Type:
Small organic molecule
Emp. Form.:
C10H6O2S2
Mol. Mass.:
222.283
SMILES:
O=C(C(=O)c1ccsc1)c1ccsc1
: