Target
Reverse transcriptase/RNaseH
Ligand
BDBM50171974
Substrate
Meas. Tech.
ChEMBL_317596 (CHEMBL825592)
pH
7.8±n/a
IC50
300±n/a nM
Comments
extracted
Citation
 O'Meara, JAYoakim, CBonneau, PRBös, MCordingley, MGDéziel, RDoyon, LDuan, JGarneau, MGuse, ILandry, SMalenfant, ENaud, JOgilvie, WWThavonekham, BSimoneau, B Novel 8-substituted dipyridodiazepinone inhibitors with a broad-spectrum of activity against HIV-1 strains resistant to non-nucleoside reverse transcriptase inhibitors. J Med Chem 48:5580-8 (2005)  
Target
Name:
Reverse transcriptase/RNaseH
Synonyms:
HIV-1 Reverse Transcriptase RNase H Reverse transcriptase/RNaseH
Type:
PROTEIN
Mol. Mass.:
65229.15
Organism:
Human immunodeficiency virus 1
Description:
ChEMBL_1473730
Residue:
566
  
Inhibitor
Name:
BDBM50171974
Synonyms:
4-[2-(5-Ethyl-7-methoxy-10-methyl-11-oxo-10,11-dihydro-5H-4,5,6,10-tetraaza-dibenzo[a,d]cyclohepten-2-yl)-ethoxy]-3-methyl-benzoic acid | CHEMBL191163
Type:
Small organic molecule
Emp. Form.:
C25H26N4O5
Mol. Mass.:
462.4977
SMILES:
CCN1c2nc(OC)ccc2N(C)C(=O)c2cc(CCOc3ccc(cc3C)C(O)=O)cnc12
: