Target
Reverse transcriptase/RNaseH
Ligand
BDBM50171979
Substrate
Meas. Tech.
ChEMBL_306910 (CHEMBL829189)
pH
7.8±n/a
IC50
14±n/a nM
Comments
extracted
Citation
 O'Meara, JAYoakim, CBonneau, PRBös, MCordingley, MGDéziel, RDoyon, LDuan, JGarneau, MGuse, ILandry, SMalenfant, ENaud, JOgilvie, WWThavonekham, BSimoneau, B Novel 8-substituted dipyridodiazepinone inhibitors with a broad-spectrum of activity against HIV-1 strains resistant to non-nucleoside reverse transcriptase inhibitors. J Med Chem 48:5580-8 (2005)  
Target
Name:
Reverse transcriptase/RNaseH
Synonyms:
HIV-1 Reverse Transcriptase RNase H Reverse transcriptase/RNaseH
Type:
PROTEIN
Mol. Mass.:
65229.15
Organism:
Human immunodeficiency virus 1
Description:
ChEMBL_1473730
Residue:
566
  
Inhibitor
Name:
BDBM50171979
Synonyms:
6-[2-(5-Ethyl-10-methyl-11-oxo-10,11-dihydro-5H-4,5,6,10-tetraaza-dibenzo[a,d]cyclohepten-2-yl)-ethoxy]-naphthalene-2-carboxylic acid | CHEMBL192231
Type:
Small organic molecule
Emp. Form.:
C27H24N4O4
Mol. Mass.:
468.5039
SMILES:
CCN1c2ncccc2N(C)C(=O)c2cc(CCOc3ccc4cc(ccc4c3)C(O)=O)cnc12
: