Target
Peroxisome proliferator-activated receptor gamma
Ligand
BDBM50171996
Substrate
Meas. Tech.
ChEMBL_306114 (CHEMBL830065)
IC50
3110±n/a nM
Citation
 Shi, GQDropinski, JFZhang, YSantini, CSahoo, SPBerger, JPMacnaul, KLZhou, GAgrawal, AAlvaro, RCai, TQHernandez, MWright, SDMoller, DEHeck, JVMeinke, PT Novel 2,3-dihydrobenzofuran-2-carboxylic acids: highly potent and subtype-selective PPARalpha agonists with potent hypolipidemic activity. J Med Chem 48:5589-99 (2005)  
Target
Name:
Peroxisome proliferator-activated receptor gamma
Synonyms:
NR1C3 PPAR-gamma PPARG_HUMAN Peroxisome proliferator-activated receptor gamma (PPAR gamma) Peroxisome proliferator-activated receptor gamma (PPARĪ³) peroxisome proliferator-activated receptor gamma isoform 2
Type:
Nuclear Receptor
Mol. Mass.:
57613.46
Organism:
Homo sapiens (Human)
Description:
P37231
Residue:
505
  
Inhibitor
Name:
BDBM50171996
Synonyms:
2-Ethyl-5-[3-(2-propyl-4-trifluoromethylsulfanyl-phenoxy)-propoxy]-2,3-dihydro-benzofuran-2-carboxylic acid | CHEMBL192500
Type:
Small organic molecule
Emp. Form.:
C24H27F3O5S
Mol. Mass.:
484.528
SMILES:
CCCc1cc(SC(F)(F)F)ccc1OCCCOc1ccc2OC(CC)(Cc2c1)C(O)=O
: