Target
Peroxisome proliferator-activated receptor delta
Ligand
BDBM50171986
Substrate
Meas. Tech.
ChEBML_306113
IC50
>15000±n/a nM
Citation
 Shi, GQDropinski, JFZhang, YSantini, CSahoo, SPBerger, JPMacnaul, KLZhou, GAgrawal, AAlvaro, RCai, TQHernandez, MWright, SDMoller, DEHeck, JVMeinke, PT Novel 2,3-dihydrobenzofuran-2-carboxylic acids: highly potent and subtype-selective PPARalpha agonists with potent hypolipidemic activity. J Med Chem 48:5589-99 (2005)  
Target
Name:
Peroxisome proliferator-activated receptor delta
Synonyms:
NR1C2 NUCI Nuclear receptor subfamily 1 group C member 2 PPAR-beta PPARD Peroxisome proliferator-activated receptor Peroxisome proliferator-activated receptor delta
Type:
Enzyme
Mol. Mass.:
49910.45
Organism:
Homo sapiens (Human)
Description:
Q03181
Residue:
441
  
Inhibitor
Name:
BDBM50171986
Synonyms:
5-{3-[2-Chloro-4-(2,2,2-trifluoro-ethoxy)-phenoxy]-propoxy}-2,3-dihydro-benzofuran-2-carboxylic acid | CHEMBL363154
Type:
Small organic molecule
Emp. Form.:
C20H18ClF3O6
Mol. Mass.:
446.802
SMILES:
OC(=O)C1Cc2cc(OCCCOc3ccc(OCC(F)(F)F)cc3Cl)ccc2O1
: