Target
Peroxisome proliferator-activated receptor gamma
Ligand
BDBM50171989
Substrate
Meas. Tech.
ChEMBL_306114 (CHEMBL830065)
IC50
>15000±n/a nM
Citation
 Shi, GQDropinski, JFZhang, YSantini, CSahoo, SPBerger, JPMacnaul, KLZhou, GAgrawal, AAlvaro, RCai, TQHernandez, MWright, SDMoller, DEHeck, JVMeinke, PT Novel 2,3-dihydrobenzofuran-2-carboxylic acids: highly potent and subtype-selective PPARalpha agonists with potent hypolipidemic activity. J Med Chem 48:5589-99 (2005)  
Target
Name:
Peroxisome proliferator-activated receptor gamma
Synonyms:
NR1C3 PPAR-gamma PPARG_HUMAN Peroxisome proliferator-activated receptor gamma (PPAR gamma) Peroxisome proliferator-activated receptor gamma (PPARĪ³) peroxisome proliferator-activated receptor gamma isoform 2
Type:
Nuclear Receptor
Mol. Mass.:
57613.46
Organism:
Homo sapiens (Human)
Description:
P37231
Residue:
505
  
Inhibitor
Name:
BDBM50171989
Synonyms:
(R)-5-[3-(2-Chloro-4-trifluoromethoxy-phenoxy)-propoxy]-2-ethyl-2,3-dihydro-benzofuran-2-carboxylic acid | CHEMBL192291
Type:
Small organic molecule
Emp. Form.:
C21H20ClF3O6
Mol. Mass.:
460.828
SMILES:
CC[C@@]1(Cc2cc(OCCCOc3ccc(OC(F)(F)F)cc3Cl)ccc2O1)C(O)=O
: