Target
Peroxisome proliferator-activated receptor alpha
Ligand
BDBM50172003
Substrate
Meas. Tech.
ChEMBL_310800 (CHEMBL824851)
EC50
2±n/a nM
Citation
 Shi, GQDropinski, JFZhang, YSantini, CSahoo, SPBerger, JPMacnaul, KLZhou, GAgrawal, AAlvaro, RCai, TQHernandez, MWright, SDMoller, DEHeck, JVMeinke, PT Novel 2,3-dihydrobenzofuran-2-carboxylic acids: highly potent and subtype-selective PPARalpha agonists with potent hypolipidemic activity. J Med Chem 48:5589-99 (2005)  
Target
Name:
Peroxisome proliferator-activated receptor alpha
Synonyms:
NR1C1 PPAR PPAR-alpha PPARA_HUMAN Peroxisome proliferator-activated receptor | Peroxisome proliferator-activated receptor alpha (PPAR alpha)
Type:
Enzyme
Mol. Mass.:
52222.08
Organism:
Homo sapiens (Human)
Description:
Q07869
Residue:
468
  
Inhibitor
Name:
BDBM50172003
Synonyms:
(R)-5-[3-(2-Chloro-4-trifluoromethoxy-phenoxy)-propoxy]-2-isopropyl-2,3-dihydro-benzofuran-2-carboxylic acid | CHEMBL366145
Type:
Small organic molecule
Emp. Form.:
C22H22ClF3O6
Mol. Mass.:
474.855
SMILES:
CC(C)[C@]1(Cc2cc(OCCCOc3ccc(OC(F)(F)F)cc3Cl)ccc2O1)C(O)=O
: