Target
Peroxisome proliferator-activated receptor alpha
Ligand
BDBM50171993
Substrate
Meas. Tech.
ChEBML_310800
EC50
31±n/a nM
Citation
 Shi, GQDropinski, JFZhang, YSantini, CSahoo, SPBerger, JPMacnaul, KLZhou, GAgrawal, AAlvaro, RCai, TQHernandez, MWright, SDMoller, DEHeck, JVMeinke, PT Novel 2,3-dihydrobenzofuran-2-carboxylic acids: highly potent and subtype-selective PPARalpha agonists with potent hypolipidemic activity. J Med Chem 48:5589-99 (2005)  
Target
Name:
Peroxisome proliferator-activated receptor alpha
Synonyms:
NR1C1 PPAR PPAR-alpha PPARA_HUMAN Peroxisome proliferator-activated receptor | Peroxisome proliferator-activated receptor alpha (PPAR alpha)
Type:
Enzyme
Mol. Mass.:
52222.08
Organism:
Homo sapiens (Human)
Description:
Q07869
Residue:
468
  
Inhibitor
Name:
BDBM50171993
Synonyms:
5-[3-(2-Chloro-4-trifluoromethylsulfanyl-phenoxy)-propoxy]-2-ethyl-2,3-dihydro-benzofuran-2-carboxylic acid | CHEMBL425725
Type:
Small organic molecule
Emp. Form.:
C21H20ClF3O5S
Mol. Mass.:
476.894
SMILES:
CCC1(Cc2cc(OCCCOc3ccc(SC(F)(F)F)cc3Cl)ccc2O1)C(O)=O
: