Target
Peroxisome proliferator-activated receptor alpha
Ligand
BDBM50171997
Substrate
Meas. Tech.
ChEBML_310805
EC50
2±n/a nM
Citation
 Shi, GQDropinski, JFZhang, YSantini, CSahoo, SPBerger, JPMacnaul, KLZhou, GAgrawal, AAlvaro, RCai, TQHernandez, MWright, SDMoller, DEHeck, JVMeinke, PT Novel 2,3-dihydrobenzofuran-2-carboxylic acids: highly potent and subtype-selective PPARalpha agonists with potent hypolipidemic activity. J Med Chem 48:5589-99 (2005)  
Target
Name:
Peroxisome proliferator-activated receptor alpha
Synonyms:
NR1C1 PPAR-alpha PPARA_CANLF
Type:
PROTEIN
Mol. Mass.:
52119.89
Organism:
Canis familiaris
Description:
ChEMBL_796444
Residue:
468
  
Inhibitor
Name:
BDBM50171997
Synonyms:
5-{3-[2-Chloro-4-(2,2-dimethyl-propyl)-phenoxy]-propoxy}-2-ethyl-2,3-dihydro-benzofuran-2-carboxylic acid | CHEMBL190334
Type:
Small organic molecule
Emp. Form.:
C25H31ClO5
Mol. Mass.:
446.964
SMILES:
CCC1(Cc2cc(OCCCOc3ccc(CC(C)(C)C)cc3Cl)ccc2O1)C(O)=O
: