Target
Receptor tyrosine-protein kinase erbB-2
Ligand
BDBM13917
Substrate
Poly(Glu,Tyr)
Meas. Tech.
ChEMBL_322346 (CHEMBL873517)
IC50
9700±n/a nM
Citation
 Fink, BEVite, GDMastalerz, HKadow, JFKim, SHLeavitt, KJDu, KCrews, DMitt, TWong, TWHunt, JTVyas, DMTokarski, JS New dual inhibitors of EGFR and HER2 protein tyrosine kinases. Bioorg Med Chem Lett 15:4774-9 (2005)  
Target
Name:
Receptor tyrosine-protein kinase erbB-2
Synonyms:
2.7.10.1 CD_antigen=CD340 ERBB2_HUMAN FASN/HER2 HER2 MLN19 NEU Proto-oncogene Neu Tyrosine kinase-type cell surface receptor HER2 | p185erbB2
Type:
Mol. Mass.:
137894.47
Organism:
Homo sapiens (Human)
Description:
P04626
Residue:
1255
  
Inhibitor
Name:
BDBM13917
Synonyms:
1-benzyl-N-{5-ethyl-6-[(ethylamino)methyl]pyrrolo[1,2-a][1,2,4]triazin-4-yl}-1H-indazol-5-amine pyrrolo[2,1-f][1,2,4]triazine analog 11
Type:
Small organic molecule
Emp. Form.:
C25H27N7
Mol. Mass.:
425.5288
SMILES:
CCNCc1cn2ncnc(Nc3ccc4n(Cc5ccccc5)ncc4c3)c2c1CC
:
Substrate
Name:
Poly(Glu,Tyr)
Synonyms:
poly(E:Y) 4:1 | poly(Glu4/Tyr)
Type:
Random Polymer
Mol. Mass.:
358.43
Organism:
Description:
Residue:
3
NA