Target
Epidermal growth factor receptor
Ligand
BDBM13903
Substrate
Poly(Glu,Tyr)
Meas. Tech.
ChEMBL_322346 (CHEMBL873517)
IC50
200±n/a nM
Citation
 Fink, BEVite, GDMastalerz, HKadow, JFKim, SHLeavitt, KJDu, KCrews, DMitt, TWong, TWHunt, JTVyas, DMTokarski, JS New dual inhibitors of EGFR and HER2 protein tyrosine kinases. Bioorg Med Chem Lett 15:4774-9 (2005)  
Target
Name:
Epidermal growth factor receptor
Synonyms:
EGF Receptor Substrate EGFR_HUMAN ERBB1 Epidermal Growth Factor Receptor erbB-1 Epidermal growth factor receptor (EGFR) HER1 Proto-oncogene c-ErbB-1 Tyrosine-Protein Kinase ErbB-1
Type:
Receptor Kinase Domain
Mol. Mass.:
134279.59
Organism:
Homo sapiens (Human)
Description:
P00533
Residue:
1210
  
Inhibitor
Name:
BDBM13903
Synonyms:
ethyl 5-ethyl-4-{[(1R)-1-phenylethyl]amino}pyrrolo[1,2-a][1,2,4]triazine-6-carboxylate | pyrrolo[2,1-f][1,2,4]triazine analog 5d
Type:
Small organic molecule
Emp. Form.:
C19H22N4O2
Mol. Mass.:
338.4036
SMILES:
CCOC(=O)c1cn2ncnc(N[C@H](C)c3ccccc3)c2c1CC
:
Substrate
Name:
Poly(Glu,Tyr)
Synonyms:
poly(E:Y) 4:1 | poly(Glu4/Tyr)
Type:
Random Polymer
Mol. Mass.:
358.43
Organism:
Description:
Residue:
3
NA