Target
Cytochrome P450 2C9
Ligand
BDBM50172462
Substrate
Meas. Tech.
ChEMBL_322412 (CHEMBL871888)
IC50
20000±n/a nM
Citation
 Peretto, IRadaelli, SParini, CZandi, MRaveglia, LFDondio, GFontanella, LMisiano, PBigogno, CRizzi, ARiccardi, BBiscaioli, MMarchetti, SPuccini, PCatinella, SRondelli, ICenacchi, VBolzoni, PTCaruso, PVilletti, GFacchinetti, FDel Giudice, EMoretto, NImbimbo, BP Synthesis and biological activity of flurbiprofen analogues as selective inhibitors of beta-amyloid(1)(-)(42) secretion. J Med Chem 48:5705-20 (2005)  
Target
Name:
Cytochrome P450 2C9
Synonyms:
(R)-limonene 6-monooxygenase CP2C9_HUMAN CYP2C9 Cytochrome P450 2C9 (CYP2C9 ) P-450MP P450 PB-1 | S-mephenytoin 4-hydroxylase
Type:
Enzyme
Mol. Mass.:
55636.33
Organism:
Homo sapiens (Human)
Description:
P11712
Residue:
490
  
Inhibitor
Name:
BDBM50172462
Synonyms:
1-[2-Fluoro-4'-(4-trifluoromethyl-cyclohexyloxy)-biphenyl-4-yl]-cyclopropanecarboxylic acid | CHEMBL436483
Type:
Small organic molecule
Emp. Form.:
C23H22F4O3
Mol. Mass.:
422.4126
SMILES:
OC(=O)C1(CC1)c1ccc(c(F)c1)-c1ccc(OC2CCC(CC2)C(F)(F)F)cc1
: