Target
Amyloid-beta precursor protein
Ligand
BDBM50172467
Substrate
Meas. Tech.
ChEMBL_321299 (CHEMBL881395)
IC50
101000±n/a nM
Citation
 Peretto, IRadaelli, SParini, CZandi, MRaveglia, LFDondio, GFontanella, LMisiano, PBigogno, CRizzi, ARiccardi, BBiscaioli, MMarchetti, SPuccini, PCatinella, SRondelli, ICenacchi, VBolzoni, PTCaruso, PVilletti, GFacchinetti, FDel Giudice, EMoretto, NImbimbo, BP Synthesis and biological activity of flurbiprofen analogues as selective inhibitors of beta-amyloid(1)(-)(42) secretion. J Med Chem 48:5705-20 (2005)  
Target
Name:
Amyloid-beta precursor protein
Synonyms:
A4 ABPP AICD-50 AICD-59 AID(57) APP Alzheimer disease amyloid protein Amyloid beta Protein Amyloid beta protein Abeta(1-42) Amyloid intracellular domain 57 Amyloid protein (Abeta42b) Beta amyloid A4 protein Beta-APP42 Beta-amyloid protein 42 C83 CVAP Gamma Secretase Gamma-CTF(57) Gamma-secretase Gamma-secretase C-terminal fragment 57 P3(40) PN-II Protease nexin-II S-APP-beta Soluble APP-beta | beta-Amyloid Precursor Protein (APP)
Type:
Single-pass type I membrane protein
Mol. Mass.:
86890.41
Organism:
Homo sapiens (Human)
Description:
P05067
Residue:
770
  
Inhibitor
Name:
BDBM50172467
Synonyms:
1-[4'-(4,4-Dimethyl-cyclohexyl)-2-fluoro-biphenyl-4-yl]-cyclopropanecarboxylic acid | CHEMBL372751
Type:
Small organic molecule
Emp. Form.:
C24H27FO2
Mol. Mass.:
366.4684
SMILES:
CC1(C)CCC(CC1)c1ccc(cc1)-c1ccc(cc1F)C1(CC1)C(O)=O
: