Target
Cytochrome P450 2C19
Ligand
BDBM50172459
Substrate
Meas. Tech.
ChEMBL_322416 (CHEMBL873538)
IC50
35000±n/a nM
Citation
 Peretto, IRadaelli, SParini, CZandi, MRaveglia, LFDondio, GFontanella, LMisiano, PBigogno, CRizzi, ARiccardi, BBiscaioli, MMarchetti, SPuccini, PCatinella, SRondelli, ICenacchi, VBolzoni, PTCaruso, PVilletti, GFacchinetti, FDel Giudice, EMoretto, NImbimbo, BP Synthesis and biological activity of flurbiprofen analogues as selective inhibitors of beta-amyloid(1)(-)(42) secretion. J Med Chem 48:5705-20 (2005)  
Target
Name:
Cytochrome P450 2C19
Synonyms:
CP2CJ_HUMAN CYPIIC17 Cytochrome P450 2C19 (CYP2C19) Mephenytoin 4-hydroxylase P450-254C
Type:
Enzyme
Mol. Mass.:
55935.47
Organism:
Homo sapiens (Human)
Description:
P33261
Residue:
490
  
Inhibitor
Name:
BDBM50172459
Synonyms:
1-(2-Fluoro-4''-hydroxy-[1,1';4',1'']terphenyl-4-yl)-cyclopropanecarboxylic acid | CHEMBL196947
Type:
Small organic molecule
Emp. Form.:
C22H17FO3
Mol. Mass.:
348.367
SMILES:
OC(=O)C1(CC1)c1ccc(c(F)c1)-c1ccc(cc1)-c1ccc(O)cc1
: