Target
Sodium-dependent dopamine transporter
Ligand
BDBM50172767
Substrate
Meas. Tech.
ChEMBL_320837 (CHEMBL871679)
Ki
13±n/a nM
Citation
 Beadle, CDBoot, JCamp, NPDezutter, NFindlay, JHayhurst, LMasters, JJPenariol, RWalter, MW 1-Aryl-3,4-dihydro-1H-quinolin-2-one derivatives, novel and selective norepinephrine reuptake inhibitors. Bioorg Med Chem Lett 15:4432-7 (2005)  
Target
Name:
Sodium-dependent dopamine transporter
Synonyms:
DA transporter DAT1 Dopamine transporter protein (DAT) SC6A3_HUMAN Sodium-dependent dopamine transporter Solute carrier family 6 member 3
Type:
Multi-pass membrane protein
Mol. Mass.:
68497.11
Organism:
Homo sapiens (Human)
Description:
Q01959
Residue:
620
  
Inhibitor
Name:
BDBM50172767
Synonyms:
1-(3,4-Dichloro-phenyl)-3-(3-methylamino-propyl)-3,4-dihydro-1H-quinolin-2-one | CHEMBL198275
Type:
Small organic molecule
Emp. Form.:
C19H20Cl2N2O
Mol. Mass.:
363.281
SMILES:
CNCCCC1Cc2ccccc2N(C1=O)c1ccc(Cl)c(Cl)c1
: