Target
Sodium-dependent noradrenaline transporter
Ligand
BDBM50172777
Substrate
Meas. Tech.
ChEMBL_320846 (CHEMBL884631)
Ki
9±n/a nM
Citation
 Beadle, CDBoot, JCamp, NPDezutter, NFindlay, JHayhurst, LMasters, JJPenariol, RWalter, MW 1-Aryl-3,4-dihydro-1H-quinolin-2-one derivatives, novel and selective norepinephrine reuptake inhibitors. Bioorg Med Chem Lett 15:4432-7 (2005)  
Target
Name:
Sodium-dependent noradrenaline transporter
Synonyms:
Monoamine transporter NET Noradrenaline Transporter (NET) Norepinephrine transporter protein (NET) SLC6A2 Sodium-dependent noradrenaline transporter (NET) | Solute carrier family 6 member 2
Type:
Multi-pass membrane protein
Mol. Mass.:
69337.72
Organism:
Homo sapiens (Human)
Description:
P23975
Residue:
617
  
Inhibitor
Name:
BDBM50172777
Synonyms:
3-Methyl-3-(3-methylamino-propyl)-1-p-tolyl-3,4-dihydro-1H-quinolin-2-one | CHEMBL198176
Type:
Small organic molecule
Emp. Form.:
C21H26N2O
Mol. Mass.:
322.4439
SMILES:
CNCCCC1(C)Cc2ccccc2N(C1=O)c1ccc(C)cc1
: