Target
Peroxisome proliferator-activated receptor gamma
Ligand
BDBM50172817
Substrate
Meas. Tech.
ChEMBL_321003 (CHEMBL872288)
Ki
1050±n/a nM
Citation
 Caijo, FMosset, PGrée, RAudinot-Bouchez, VBoutin, JRenard, PCaignard, DHDacquet, C Synthesis of new carbo- and heterocyclic analogues of 8-HETE and evaluation of their activity towards the PPARs. Bioorg Med Chem Lett 15:4421-6 (2005)  
Target
Name:
Peroxisome proliferator-activated receptor gamma
Synonyms:
NR1C3 PPAR-gamma PPARG_HUMAN Peroxisome proliferator-activated receptor gamma (PPAR gamma) Peroxisome proliferator-activated receptor gamma (PPARĪ³) peroxisome proliferator-activated receptor gamma isoform 2
Type:
Nuclear Receptor
Mol. Mass.:
57613.46
Organism:
Homo sapiens (Human)
Description:
P37231
Residue:
505
  
Inhibitor
Name:
BDBM50172817
Synonyms:
8-Hydroxy-8-(2-pentyloxy-phenyl)-oct-5-ynoic acid methyl ester | CHEMBL194698
Type:
Small organic molecule
Emp. Form.:
C20H28O4
Mol. Mass.:
332.4339
SMILES:
CCCCCOc1ccccc1C(O)CC#CCCCC(=O)OC
: