Target
Mitogen-activated protein kinase 14
Ligand
BDBM50172925
Substrate
Meas. Tech.
ChEMBL_321385 (CHEMBL881763)
IC50
30±n/a nM
Citation
 Swahn, BMHuerta, FKallin, EMalmström, JWeigelt, TViklund, JWomack, PXue, YOhberg, L Design and synthesis of 6-anilinoindazoles as selective inhibitors of c-Jun N-terminal kinase-3. Bioorg Med Chem Lett 15:5095-9 (2005)  
Target
Name:
Mitogen-activated protein kinase 14
Synonyms:
CSAID-binding protein CSBP1 CSPB1 MAP kinase 14 MAP kinase p38 alpha MAPK14 MK14_HUMAN Mitogen-activated protein kinase p38 alpha Stress-activated protein kinase 2a | p38 MAP kinase alpha/beta
Type:
Serine/threonine-protein kinase
Mol. Mass.:
41286.76
Organism:
Homo sapiens (Human)
Description:
Q16539
Residue:
360
  
Inhibitor
Name:
BDBM50172925
Synonyms:
CHEMBL383177 Phenyl-(3-phenyl-1H-indazol-6-yl)-amine
Type:
Small organic molecule
Emp. Form.:
C19H15N3
Mol. Mass.:
285.3425
SMILES:
N(c1ccccc1)c1ccc2c(n[nH]c2c1)-c1ccccc1
: