Target
Mitogen-activated protein kinase 10
Ligand
BDBM50172927
Substrate
Meas. Tech.
ChEMBL_321305 (CHEMBL881401)
IC50
5.3±n/a nM
Citation
 Swahn, BMHuerta, FKallin, EMalmström, JWeigelt, TViklund, JWomack, PXue, YOhberg, L Design and synthesis of 6-anilinoindazoles as selective inhibitors of c-Jun N-terminal kinase-3. Bioorg Med Chem Lett 15:5095-9 (2005)  
Target
Name:
Mitogen-activated protein kinase 10
Synonyms:
JNK3 MAP kinase p49 3F12 MK10_HUMAN Mitogen-activated protein kinase 10 (Stress-activated protein kinase JNK3) (c-Jun N-terminal kinase 3) (MAP kinase p49 3F12) PRKM10 Stress-activated protein kinase JNK3 | c-Jun N-terminal kinase 3 (JNK3)
Type:
Enzyme
Mol. Mass.:
52586.89
Organism:
Homo sapiens (Human)
Description:
Residue:
464
  
Inhibitor
Name:
BDBM50172927
Synonyms:
3-[6-(2-Chloro-phenylamino)-1H-indazol-3-yl]-benzoic acid | CHEMBL197613
Type:
Small organic molecule
Emp. Form.:
C20H14ClN3O2
Mol. Mass.:
363.797
SMILES:
OC(=O)c1cccc(c1)-c1n[nH]c2cc(Nc3ccccc3Cl)ccc12
: