Target
Branched-chain-amino-acid aminotransferase, cytosolic
Ligand
BDBM50172928
Substrate
Meas. Tech.
ChEMBL_348855 (CHEMBL866887)
IC50
33300±n/a nM
Citation
 Hu, LYBoxer, PAKesten, SRLei, HJWustrow, DJMoreland, DWZhang, LAhn, KRyder, TRLiu, XRubin, JRFahnoe, KCarroll, RTDutta, SFahnoe, DCProbert, AWRoof, RLRafferty, MFKostlan, CRScholten, JDHood, MRen, XDSchielke, GPSu, TZTaylor, CPMistry, AMcConnell, PHasemann, COhren, J The design and synthesis of human branched-chain amino acid aminotransferase inhibitors for treatment of neurodegenerative diseases. Bioorg Med Chem Lett 16:2337-40 (2006)  
Target
Name:
Branched-chain-amino-acid aminotransferase, cytosolic
Synonyms:
BCAT1 BCT1 ECA39
Type:
PROTEIN
Mol. Mass.:
42957.10
Organism:
Homo sapiens (Human)
Description:
ChEMBL_1516919
Residue:
386
  
Inhibitor
Name:
BDBM50172928
Synonyms:
CHEMBL382232 | N'-(phenylsulfonyl)quinoline-3-carbohydrazide
Type:
Small organic molecule
Emp. Form.:
C16H13N3O3S
Mol. Mass.:
327.358
SMILES:
O=C(NNS(=O)(=O)c1ccccc1)c1cnc2ccccc2c1
: