Target
Prostaglandin G/H synthase 2
Ligand
BDBM50173288
Substrate
Meas. Tech.
ChEMBL_321226 (CHEMBL881226)
IC50
2±n/a nM
Citation
 Toyokuni, TKumar, JSWalsh, JCShapiro, ATalley, JJPhelps, MEHerschman, HRBarrio, JRSatyamurthy, N Synthesis of 4-(5-[18F]fluoromethyl-3-phenylisoxazol-4-yl)benzenesulfonamide, a new [18F]fluorinated analogue of valdecoxib, as a potential radiotracer for imaging cyclooxygenase-2 with positron emission tomography. Bioorg Med Chem Lett 15:4699-702 (2005)  
Target
Name:
Prostaglandin G/H synthase 2
Synonyms:
COX2 Cyclooxygenase 2 (COX-2) Cyclooxygenase-2 (COX-2 AA) Cyclooxygenase-2 (COX-2) PGH2_HUMAN PHS II Prostaglandin E synthase/G/H synthase 2 Prostaglandin-endoperoxide synthase 2
Type:
Enzyme
Mol. Mass.:
69003.89
Organism:
Homo sapiens (Human)
Description:
Recombinant Cox-2 provided by Cayman (Cayman Chemical Co.,Ann Arbor, MI).
Residue:
604
  
Inhibitor
Name:
BDBM50173288
Synonyms:
4-(5-Fluoromethyl-3-phenyl-isoxazol-4-yl)-benzenesulfonamide | CHEMBL371477
Type:
Small organic molecule
Emp. Form.:
C16H13FN2O3S
Mol. Mass.:
332.349
SMILES:
NS(=O)(=O)c1ccc(cc1)-c1c(CF)onc1-c1ccccc1
: