Target
Peroxisome proliferator-activated receptor gamma
Ligand
BDBM50173343
Substrate
Meas. Tech.
ChEMBL_321485 (CHEMBL880426)
IC50
19±n/a nM
Citation
 Dropinski, JFAkiyama, TEinstein, MHabulihaz, BDoebber, TBerger, JPMeinke, PTShi, GQ Synthesis and biological activities of novel aryl indole-2-carboxylic acid analogs as PPARgamma partial agonists. Bioorg Med Chem Lett 15:5035-8 (2005)  
Target
Name:
Peroxisome proliferator-activated receptor gamma
Synonyms:
NR1C3 PPAR-gamma PPARG_HUMAN Peroxisome proliferator-activated receptor gamma (PPAR gamma) Peroxisome proliferator-activated receptor gamma (PPARĪ³) peroxisome proliferator-activated receptor gamma isoform 2
Type:
Nuclear Receptor
Mol. Mass.:
57613.46
Organism:
Homo sapiens (Human)
Description:
P37231
Residue:
505
  
Inhibitor
Name:
BDBM50173343
Synonyms:
1-(4-tert-Butyl-phenyl)-6-chloro-3-(3-isopropyl-phenoxy)-1H-indole-2-carboxylic acid | CHEMBL372639
Type:
Small organic molecule
Emp. Form.:
C28H28ClNO3
Mol. Mass.:
461.98
SMILES:
CC(C)c1cccc(Oc2c(C(O)=O)n(-c3ccc(cc3)C(C)(C)C)c3cc(Cl)ccc23)c1
: