Target
Peroxisome proliferator-activated receptor alpha
Ligand
BDBM50173360
Substrate
Meas. Tech.
ChEMBL_321484 (CHEMBL880425)
IC50
>50000±n/a nM
Citation
 Dropinski, JFAkiyama, TEinstein, MHabulihaz, BDoebber, TBerger, JPMeinke, PTShi, GQ Synthesis and biological activities of novel aryl indole-2-carboxylic acid analogs as PPARgamma partial agonists. Bioorg Med Chem Lett 15:5035-8 (2005)  
Target
Name:
Peroxisome proliferator-activated receptor alpha
Synonyms:
NR1C1 PPAR PPAR-alpha PPARA_HUMAN Peroxisome proliferator-activated receptor | Peroxisome proliferator-activated receptor alpha (PPAR alpha)
Type:
Enzyme
Mol. Mass.:
52222.08
Organism:
Homo sapiens (Human)
Description:
Q07869
Residue:
468
  
Inhibitor
Name:
BDBM50173360
Synonyms:
3-(3-Hydroxy-phenoxy)-1-(3-isopropyl-phenyl)-1H-indole-2-carboxylic acid | CHEMBL372850
Type:
Small organic molecule
Emp. Form.:
C24H21NO4
Mol. Mass.:
387.4278
SMILES:
CC(C)c1cccc(c1)-n1c(C(O)=O)c(Oc2cccc(O)c2)c2ccccc12
: