Target
Peroxisome proliferator-activated receptor gamma
Ligand
BDBM50173369
Substrate
Meas. Tech.
ChEMBL_321485 (CHEMBL880426)
IC50
39±n/a nM
Citation
 Dropinski, JFAkiyama, TEinstein, MHabulihaz, BDoebber, TBerger, JPMeinke, PTShi, GQ Synthesis and biological activities of novel aryl indole-2-carboxylic acid analogs as PPARgamma partial agonists. Bioorg Med Chem Lett 15:5035-8 (2005)  
Target
Name:
Peroxisome proliferator-activated receptor gamma
Synonyms:
NR1C3 PPAR-gamma PPARG_HUMAN Peroxisome proliferator-activated receptor gamma (PPAR gamma) Peroxisome proliferator-activated receptor gamma (PPARĪ³) peroxisome proliferator-activated receptor gamma isoform 2
Type:
Nuclear Receptor
Mol. Mass.:
57613.46
Organism:
Homo sapiens (Human)
Description:
P37231
Residue:
505
  
Inhibitor
Name:
BDBM50173369
Synonyms:
1-(4-tert-Butyl-phenyl)-5-methoxy-3-(3-trifluoromethyl-phenoxy)-1H-indole-2-carboxylic acid | CHEMBL197671
Type:
Small organic molecule
Emp. Form.:
C27H24F3NO4
Mol. Mass.:
483.479
SMILES:
COc1ccc2n(c(C(O)=O)c(Oc3cccc(c3)C(F)(F)F)c2c1)-c1ccc(cc1)C(C)(C)C
: