Target
Gamma-aminobutyric acid receptor subunit alpha-3/beta-3/gamma-2
Ligand
BDBM50173673
Substrate
Meas. Tech.
ChEMBL_321026 (CHEMBL882867)
pH
7.4±n/a
Ki
>666±n/a nM
Comments
extracted
Citation
 van Niel, MBWilson, KAdkins, CHAtack, JRCastro, JLClarke, DEFletcher, SGerhard, UMackey, MMMalpas, SMaubach, KNewman, RO'Connor, DPillai, GVSimpson, PBThomas, SRMacLeod, AM A new pyridazine series of GABAA alpha5 ligands. J Med Chem 48:6004-11 (2005)  
Target
Name:
Gamma-aminobutyric acid receptor subunit alpha-3/beta-3/gamma-2
Synonyms:
GABA receptor alpha-3/beta-3/gamma-2 subunit | GABA-A receptor; alpha-3/beta-3/gamma-2
Type:
Mol. Mass.:
Description:
ASSAY_ID of EBI is 68410
Components:
This complex has 3 components.
Component 1
Name:
Gamma-aminobutyric acid receptor subunit gamma-2
Synonyms:
GABA(A) receptor subunit gamma-2 GBRG2_HUMAN
Type:
PROTEIN
Mol. Mass.:
54172.74
Organism:
Homo sapiens (Human)
Description:
EBI_217
Residue:
467
  
Component 2
Name:
Gamma-aminobutyric acid receptor subunit beta-3
Synonyms:
GABA A receptor alpha-4/beta-3/gamma-2 GABA-A receptor GBRB3_HUMAN | agonist GABA site
Type:
PROTEIN
Mol. Mass.:
54130.51
Organism:
Homo sapiens (Human)
Description:
ChEMBL_448071
Residue:
473
  
Component 3
Name:
Gamma-aminobutyric acid receptor subunit alpha-3
Synonyms:
GABA A Alpha3Beta3Gamma2 GABA C GABA-A receptor GBRA3_HUMAN agonist GABA site
Type:
Enzyme Catalytic Domain
Mol. Mass.:
55175.47
Organism:
Homo sapiens (Human)
Description:
GABA A Alpha3Beta1Gamma2 0 HUMAN::P34903
Residue:
492
  
Inhibitor
Name:
BDBM50173673
Synonyms:
3-(5-Phenyl-pyridazin-3-yl)-benzonitrile | CHEMBL198816
Type:
Small organic molecule
Emp. Form.:
C17H11N3
Mol. Mass.:
257.2893
SMILES:
N#Cc1cccc(c1)-c1cc(cnn1)-c1ccccc1
: