Target
Gamma-aminobutyric acid receptor subunit alpha-1/beta-3/gamma-2
Ligand
BDBM50173700
Substrate
Meas. Tech.
ChEMBL_321025 (CHEMBL882866)
pH
7.4±n/a
Ki
1.3±n/a nM
Comments
extracted
Citation
 van Niel, MBWilson, KAdkins, CHAtack, JRCastro, JLClarke, DEFletcher, SGerhard, UMackey, MMMalpas, SMaubach, KNewman, RO'Connor, DPillai, GVSimpson, PBThomas, SRMacLeod, AM A new pyridazine series of GABAA alpha5 ligands. J Med Chem 48:6004-11 (2005)  
Target
Name:
Gamma-aminobutyric acid receptor subunit alpha-1/beta-3/gamma-2
Synonyms:
GABA receptor alpha-1/beta-3/gamma-2 subunit GABAA alpha1beta3gamma2
Type:
Protein
Mol. Mass.:
Description:
Components:
This complex has 3 components.
Component 1
Name:
Gamma-aminobutyric acid receptor subunit alpha-1
Synonyms:
Benzodiazepine central GABA A Benzodiazepine liver GABA(A) receptor subunit alpha-1 GABA-A receptor GBRA1_HUMAN TBPS | agonist GABA site
Type:
Protein
Mol. Mass.:
51817.35
Organism:
Homo sapiens (Human)
Description:
P14867
Residue:
456
  
Component 2
Name:
Gamma-aminobutyric acid receptor subunit beta-3
Synonyms:
GABA A receptor alpha-4/beta-3/gamma-2 GABA-A receptor GBRB3_HUMAN | agonist GABA site
Type:
PROTEIN
Mol. Mass.:
54130.51
Organism:
Homo sapiens (Human)
Description:
ChEMBL_448071
Residue:
473
  
Component 3
Name:
Gamma-aminobutyric acid receptor subunit gamma-2
Synonyms:
GABA(A) receptor subunit gamma-2 GBRG2_HUMAN
Type:
PROTEIN
Mol. Mass.:
54172.74
Organism:
Homo sapiens (Human)
Description:
EBI_217
Residue:
467
  
Inhibitor
Name:
BDBM50173700
Synonyms:
3-Phenyl-5-(2-pyridin-4-yl-pyrimidin-4-yl)-pyridazine | CHEMBL364505
Type:
Small organic molecule
Emp. Form.:
C19H13N5
Mol. Mass.:
311.34
SMILES:
c1ccc(cc1)-c1cc(cnn1)-c1ccnc(n1)-c1ccncc1
: