Target
Reverse transcriptase/RNaseH
Ligand
BDBM50173810
Substrate
Meas. Tech.
ChEMBL_321537 (CHEMBL880597)
IC50
1000±n/a nM
Citation
 Deng, BLHartman, TLBuckheit, RWPannecouque, CDe Clercq, EFanwick, PECushman, M Synthesis, anti-HIV activity, and metabolic stability of new alkenyldiarylmethane HIV-1 non-nucleoside reverse transcriptase inhibitors. J Med Chem 48:6140-55 (2005)  
Target
Name:
Reverse transcriptase/RNaseH
Synonyms:
HIV-1 Reverse Transcriptase RNase H Reverse transcriptase/RNaseH
Type:
PROTEIN
Mol. Mass.:
65229.15
Organism:
Human immunodeficiency virus 1
Description:
ChEMBL_1473730
Residue:
566
  
Inhibitor
Name:
BDBM50173810
Synonyms:
5-[(E)-1-(3,4-Dimethoxy-phenyl)-4-(2-oxo-oxazolidin-3-yl)-but-1-enyl]-2-methoxy-3-methyl-benzoic acid methyl ester | CHEMBL198551
Type:
Small organic molecule
Emp. Form.:
C25H29NO7
Mol. Mass.:
455.5003
SMILES:
COC(=O)c1cc(cc(C)c1OC)C(=C/CCN1CCOC1=O)\c1ccc(OC)c(OC)c1
: