Target
Thyrotropin-releasing hormone receptor
Ligand
BDBM50173821
Substrate
Meas. Tech.
ChEMBL_321009 (CHEMBL872293)
pH
7.4±n/a
Ki
>100000±n/a nM
Comments
extracted
Citation
 Kaur, NLu, XGershengorn, MCJain, R Thyrotropin-releasing hormone (TRH) analogues that exhibit selectivity to TRH receptor subtype 2. J Med Chem 48:6162-5 (2005)  
Target
Name:
Thyrotropin-releasing hormone receptor
Synonyms:
Thyrotropin-releasing hormone receptor 2
Type:
PROTEIN
Mol. Mass.:
39044.21
Organism:
Rattus norvegicus
Description:
ChEMBL_532304
Residue:
352
  
Inhibitor
Name:
BDBM50173821
Synonyms:
1-[3-[2-(tert-butyl)-1H-4-imidazolyl]-2-[5-oxo-(2S)-tetrahydro-1H-2-pyrrolylcarboxamido]-(2S)-propanoyl]-(2S)-tetrahydro-1H-2-pyrrolecarboxamide | CHEMBL382714
Type:
Small organic molecule
Emp. Form.:
C20H30N6O4
Mol. Mass.:
418.49
SMILES:
CC(C)(C)c1ncc(C[C@H](NC(=O)[C@@H]2CCC(=O)N2)C(=O)N2CCC[C@H]2C(N)=O)[nH]1
: