Target
Excitatory amino acid transporter 1
Ligand
BDBM50410459
Substrate
Meas. Tech.
ChEMBL_321548 (CHEMBL881962)
IC50
300±n/a nM
Citation
 Greenfield, AGrosanu, CDunlop, JMcIlvain, BCarrick, TJow, BLu, QKowal, DWilliams, JButera, J Synthesis and biological activities of aryl-ether-, biaryl-, and fluorene-aspartic acid and diaminopropionic acid analogs as potent inhibitors of the high-affinity glutamate transporter EAAT-2. Bioorg Med Chem Lett 15:4985-8 (2005)  
Target
Name:
Excitatory amino acid transporter 1
Synonyms:
EAA1_HUMAN Excitatory Amino Acid EAAT1 GLAST1 | SLC1A3
Type:
Enzyme Catalytic Domain
Mol. Mass.:
59577.19
Organism:
Homo sapiens (Human)
Description:
Excitatory Amino Acid EAAT1 0 HUMAN::P43003
Residue:
542
  
Inhibitor
Name:
BDBM50410459
Synonyms:
CHEMBL2113117
Type:
Small organic molecule
Emp. Form.:
C17H15BrN2O3
Mol. Mass.:
375.217
SMILES:
N[C@@H](CC(=O)Nc1ccc-2c(Cc3cc(Br)ccc-23)c1)C(O)=O
: