Target
Excitatory amino acid transporter 2
Ligand
BDBM50410460
Substrate
Meas. Tech.
ChEMBL_321549 (CHEMBL881963)
IC50
130±n/a nM
Citation
 Greenfield, AGrosanu, CDunlop, JMcIlvain, BCarrick, TJow, BLu, QKowal, DWilliams, JButera, J Synthesis and biological activities of aryl-ether-, biaryl-, and fluorene-aspartic acid and diaminopropionic acid analogs as potent inhibitors of the high-affinity glutamate transporter EAAT-2. Bioorg Med Chem Lett 15:4985-8 (2005)  
Target
Name:
Excitatory amino acid transporter 2
Synonyms:
EAA2_HUMAN GLT1 SLC1A2 Solute carrier family 1 member 2
Type:
Enzyme Catalytic Domain
Mol. Mass.:
62103.57
Organism:
Homo sapiens (Human)
Description:
Excitatory Amino Acid EAAT2 0 0::P43004
Residue:
574
  
Inhibitor
Name:
BDBM50410460
Synonyms:
CHEMBL2113121
Type:
Small organic molecule
Emp. Form.:
C16H14F2N2O4
Mol. Mass.:
336.2902
SMILES:
N[C@@H](CC(=O)Nc1ccc(Oc2ccc(F)c(F)c2)cc1)C(O)=O
: