Target
Prolyl endopeptidase FAP
Ligand
BDBM50173968
Substrate
Meas. Tech.
ChEMBL_328425 (CHEMBL863966)
Ki
14639±n/a nM
Citation
 Haffner, CDMcDougald, DLReister, SMThompson, BDConlee, CFang, JBass, JLenhard, JMCroom, DSecosky-Chang, MBTomaszek, TMcConn, DWells-Knecht, KJohnson, PR 2-Cyano-4-fluoro-1-thiovalylpyrrolidine analogues as potent inhibitors of DPP-IV. Bioorg Med Chem Lett 15:5257-61 (2005)  
Target
Name:
Prolyl endopeptidase FAP
Synonyms:
170 kDa melanoma membrane-bound gelatinase Fibroblast Activation Protein (FAP) Integral membrane serine protease Seprase
Type:
Enzyme
Mol. Mass.:
87712.48
Organism:
Homo sapiens (Human)
Description:
Q12884
Residue:
760
  
Inhibitor
Name:
BDBM50173968
Synonyms:
(R)-3-amino-4-((2S,4S)-2-cyano-4-fluoropyrrolidin-1-yl)-2-methyl-4-oxobutane-2-sulfonic acid | CHEMBL199891
Type:
Small organic molecule
Emp. Form.:
C10H16FN3O4S
Mol. Mass.:
293.315
SMILES:
CC(C)([C@H](N)C(=O)N1C[C@@H](F)C[C@H]1C#N)S(O)(=O)=O
: