Target
Dipeptidyl peptidase 2
Ligand
BDBM50173973
Substrate
Meas. Tech.
ChEMBL_328424 (CHEMBL863965)
Ki
>22385±n/a nM
Citation
 Haffner, CDMcDougald, DLReister, SMThompson, BDConlee, CFang, JBass, JLenhard, JMCroom, DSecosky-Chang, MBTomaszek, TMcConn, DWells-Knecht, KJohnson, PR 2-Cyano-4-fluoro-1-thiovalylpyrrolidine analogues as potent inhibitors of DPP-IV. Bioorg Med Chem Lett 15:5257-61 (2005)  
Target
Name:
Dipeptidyl peptidase 2
Synonyms:
DAP II DPP2_HUMAN Dipeptidyl aminopeptidase II Dipeptidyl peptidase 2 (DPP2) Dipeptidyl peptidase II (DPP II) Dipeptidyl peptidase II and dipeptidyl peptidase IV (DPP2 and DPP4) carboxytripeptidase dipeptidyl(amino)peptidase II | dipeptidylarylamidase
Type:
Protein
Mol. Mass.:
54339.29
Organism:
Homo sapiens (Human)
Description:
Q9UHL4
Residue:
492
  
Inhibitor
Name:
BDBM50173973
Synonyms:
CHEMBL201053 | N-(4-(((R)-3-amino-4-((2S,4S)-2-cyano-4-fluoropyrrolidin-1-yl)-2-methyl-4-oxobutan-2-ylsulfonyl)methyl)phenyl)acetamide
Type:
Small organic molecule
Emp. Form.:
C19H25FN4O4S
Mol. Mass.:
424.49
SMILES:
CC(=O)Nc1ccc(CS(=O)(=O)C(C)(C)[C@H](N)C(=O)N2C[C@@H](F)C[C@H]2C#N)cc1
: