Target
Multidrug resistance-associated protein 1
Ligand
BDBM50173987
Substrate
Meas. Tech.
ChEMBL_321440 (CHEMBL880248)
IC50
<250±n/a nM
Citation
 Lather, VMadan, AK Topological model for the prediction of MRP1 inhibitory activity of pyrrolopyrimidines and templates derived from pyrrolopyrimidine. Bioorg Med Chem Lett 15:4967-72 (2005)  
Target
Name:
Multidrug resistance-associated protein 1
Synonyms:
7.6.2.2 ABCC1 ATP-binding cassette, sub-family C, member 1 isoform 1 LTC4 transporter MRP MRP1_HUMAN
Type:
Mol. Mass.:
171597.72
Organism:
Homo sapiens (Human)
Description:
P33527
Residue:
1531
  
Inhibitor
Name:
BDBM50173987
Synonyms:
(9-Carbamoyl-4-{4-[2-(3,4-difluoro-phenyl)-ethyl]-piperazin-1-yl}-pyrimido[5,4-b]indol-5-yl)-acetic acid ethyl ester | CHEMBL197824
Type:
Small organic molecule
Emp. Form.:
C27H28F2N6O3
Mol. Mass.:
522.5464
SMILES:
CCOC(=O)Cn1c2cccc(C(N)=O)c2c2ncnc(N3CCN(CCc4ccc(F)c(F)c4)CC3)c12
: