Target
Carbonic anhydrase 1
Ligand
BDBM50174034
Substrate
Meas. Tech.
ChEMBL_320717 (CHEMBL881703)
Ki
3±n/a nM
Citation
 Ozensoy, OPuccetti, LFasolis, GArslan, OScozzafava, ASupuran, CT Carbonic anhydrase inhibitors: inhibition of the tumor-associated isozymes IX and XII with a library of aromatic and heteroaromatic sulfonamides. Bioorg Med Chem Lett 15:4862-6 (2005)  
Target
Name:
Carbonic anhydrase 1
Synonyms:
CA-I CAB Carbonate dehydratase I Carbonic anhydrase 1 (CA I) Carbonic anhydrase 1 (Recombinant CA I) Carbonic anhydrase B Carbonic anhydrase I (CA I) Carbonic anhydrase I (CAI) Carbonic anhydrase isoenzyme I (hCA I) | hCA
Type:
Enzyme
Mol. Mass.:
28873.37
Organism:
Homo sapiens (Human)
Description:
P00915
Residue:
261
  
Inhibitor
Name:
BDBM50174034
Synonyms:
5-(4-Bromo-cyclohexa-2,4-dienesulfonylamino)-[1,3,4]thiadiazole-2-sulfonic acid amide | CHEMBL194634
Type:
Small organic molecule
Emp. Form.:
C8H7BrN4O4S3
Mol. Mass.:
399.265
SMILES:
NS(=O)(=O)c1nnc(NS(=O)(=O)c2ccc(Br)cc2)s1
: