Target
Abscisic acid 8'-hydroxylase 3
Ligand
BDBM50174072
Substrate
Meas. Tech.
ChEMBL_326985 (CHEMBL868744)
Ki
170±n/a nM
Citation
 Ueno, KYoneyama, HSaito, SMizutani, MSakata, KHirai, NTodoroki, Y A lead compound for the development of ABA 8'-hydroxylase inhibitors. Bioorg Med Chem Lett 15:5226-9 (2005)  
Target
Name:
Abscisic acid 8'-hydroxylase 3
Synonyms:
ABAH3_ARATH Cytochrome P450 monooxygenase
Type:
PROTEIN
Mol. Mass.:
52380.10
Organism:
Arabidopsis thaliana
Description:
ChEMBL_358214
Residue:
463
  
Inhibitor
Name:
BDBM50174072
Synonyms:
(+)-8',8'-difluoro-ABA | CHEMBL199709
Type:
Small organic molecule
Emp. Form.:
C15H18F2O4
Mol. Mass.:
300.2978
SMILES:
CC(C=C[C@@]1(O)C(C)=CC(=O)C[C@]1(C)C(F)F)=CC(O)=O
: