Target
Platelet-derived growth factor receptor alpha
Ligand
BDBM50174408
Substrate
Meas. Tech.
ChEMBL_321286 (CHEMBL856815)
IC50
2000±n/a nM
Citation
 Vendôme, JLetard, SMartin, FSvinarchuk, FDubreuil, PAuclair, CLe Bret, M Molecular modeling of wild-type and D816V c-Kit inhibition based on ATP-competitive binding of ellipticine derivatives to tyrosine kinases. J Med Chem 48:6194-201 (2005)  
Target
Name:
Platelet-derived growth factor receptor alpha
Synonyms:
Alpha-type platelet-derived growth factor receptor PDGFRA PGFRA_HUMAN Platelet-derived growth factor receptor alpha (PDGFRA) RHEPDGFRA
Type:
Protein
Mol. Mass.:
122633.38
Organism:
Homo sapiens (Human)
Description:
P16234
Residue:
1089
  
Inhibitor
Name:
BDBM50174408
Synonyms:
1-(3-Diethylamino-propylamino)-5,6,11-trimethyl-6H-pyrido[4,3-b]carbazol-9-ol | CHEMBL55137
Type:
Small organic molecule
Emp. Form.:
C25H32N4O
Mol. Mass.:
404.5478
SMILES:
CCN(CC)CCCNc1nccc2c(C)c3n(C)c4ccc(O)cc4c3c(C)c12
: