Target
Mast/stem cell growth factor receptor Kit
Ligand
BDBM50174413
Substrate
Meas. Tech.
ChEMBL_321480 (CHEMBL880421)
IC50
450±n/a nM
Citation
 Vendôme, JLetard, SMartin, FSvinarchuk, FDubreuil, PAuclair, CLe Bret, M Molecular modeling of wild-type and D816V c-Kit inhibition based on ATP-competitive binding of ellipticine derivatives to tyrosine kinases. J Med Chem 48:6194-201 (2005)  
Target
Name:
Mast/stem cell growth factor receptor Kit
Synonyms:
CD117 antigen KIT Mast/stem cell growth factor receptor Kit (cKIT) Proto-oncogene tyrosine-protein kinase Kit Stem cell growth factor receptor Tyrosine-protein kinase Kit c-kit v-kit Hardy-Zuckerman 4 feline sarcoma viral oncogene homolog
Type:
Protein
Mol. Mass.:
109869.37
Organism:
Homo sapiens (Human)
Description:
P10721
Residue:
976
  
Inhibitor
Name:
BDBM50174413
Synonyms:
2-(2-Diethylamino-ethyl)-9-hydroxy-5,11-dimethyl-6H-pyrido[4,3-b]carbazol-2-ium | CHEMBL197585
Type:
Small organic molecule
Emp. Form.:
C23H28N3O
Mol. Mass.:
362.4874
SMILES:
CCN(CC)CCn1ccc2c(C)c3[nH+]c4ccc(O)cc4c3c(C)c2c1
: