Target
RNA-directed RNA polymerase
Ligand
BDBM50152548
Substrate
Meas. Tech.
ChEMBL_321538 (CHEMBL880598)
pH
7.5±n/a
IC50
28000±n/a nM
Comments
extracted
Citation
 Di Santo, RFermeglia, MFerrone, MPaneni, MSCosti, RArtico, MRoux, AGabriele, MTardif, KDSiddiqui, APricl, S Simple but highly effective three-dimensional chemical-feature-based pharmacophore model for diketo acid derivatives as hepatitis C virus RNA-dependent RNA polymerase inhibitors. J Med Chem 48:6304-14 (2005)  
Target
Name:
RNA-directed RNA polymerase
Synonyms:
Hepatitis C virus NS5B RNA-dependent RNA polymerase | NS5B protein
Type:
Protein
Mol. Mass.:
25173.95
Organism:
Hepatitis C virus
Description:
Q8JXU8
Residue:
229
  
Inhibitor
Name:
BDBM50152548
Synonyms:
4-Biphenyl-3-yl-2,4-dioxo-butyric acid CHEMBL197721
Type:
Small organic molecule
Emp. Form.:
C16H12O4
Mol. Mass.:
268.2641
SMILES:
OC(=O)C(=O)CC(=O)c1cccc(c1)-c1ccccc1
: