Target
Metabotropic glutamate receptor 2
Ligand
BDBM50174515
Substrate
Meas. Tech.
ChEMBL_320826 (CHEMBL872361)
Ki
>1000000±n/a nM
Citation
 Conti, PDe Amici, MGrazioso, GRoda, GPinto, AHansen, KBNielsen, BMadsen, UBräuner-Osborne, HEgebjerg, JVestri, VPellegrini-Giampietro, DESibille, PAcher, FCDe Micheli, C Synthesis, binding affinity at glutamic acid receptors, neuroprotective effects, and molecular modeling investigation of novel dihydroisoxazole amino acids. J Med Chem 48:6315-25 (2005)  
Target
Name:
Metabotropic glutamate receptor 2
Synonyms:
GPRC1B GRM2_HUMAN Metabotropic glutamate receptor mGlu2 | metabotropic glutamate 2
Type:
Enzyme
Mol. Mass.:
95584.88
Organism:
Homo sapiens (Human)
Description:
Q14416
Residue:
872
  
Inhibitor
Name:
BDBM50174515
Synonyms:
(3aR,5S,6aR)-5-Amino-4,5,6,6a-tetrahydro-3aH-cyclopenta[d]isoxazole-3,5-dicarboxylic acid | CHEMBL415461
Type:
Small organic molecule
Emp. Form.:
C8H10N2O5
Mol. Mass.:
214.1754
SMILES:
N[C@@]1(C[C@H]2ON=C([C@H]2C1)C(O)=O)C(O)=O
: