Target
Sodium/glucose cotransporter 2
Ligand
BDBM20877
Substrate
Meas. Tech.
ChEMBL_326560 (CHEMBL863286)
IC50
11±n/a nM
Citation
 Zhang, XUrbanski, MPatel, MZeck, RECox, GGBian, HConway, BRPat Beavers, MRybczynski, PJDemarest, KT Heteroaryl-O-glucosides as novel sodium glucose co-transporter 2 inhibitors. Part 1. Bioorg Med Chem Lett 15:5202-6 (2005)  
Target
Name:
Sodium/glucose cotransporter 2
Synonyms:
Na(+)/glucose cotransporter 2 SGLT2 Sodium-Dependent Glucose Cotransporter 2 (SGLT2) Solute carrier family 5 member 2
Type:
Protein
Mol. Mass.:
72902.00
Organism:
Homo sapiens (Human)
Description:
P31639
Residue:
672
  
Inhibitor
Name:
BDBM20877
Synonyms:
3-(1-benzofuran-5-yl)-1-(2-hydroxy-4-methyl-6-{[(2S,3R,4S,5S,6R)-3,4,5-trihydroxy-6-(hydroxymethyl)oxan-2-yl]oxy}phenyl)propan-1-one JMC511145 Compound 2 T-1095A
Type:
Small organic molecule
Emp. Form.:
C24H26O9
Mol. Mass.:
458.4578
SMILES:
Cc1cc(O)c(C(=O)CCc2ccc3occc3c2)c(O[C@@H]2O[C@H](CO)[C@@H](O)[C@H](O)[C@H]2O)c1
: