Target
Sodium/glucose cotransporter 1
Ligand
BDBM50174679
Substrate
Meas. Tech.
ChEMBL_326559 (CHEMBL863284)
IC50
198±n/a nM
Citation
 Zhang, XUrbanski, MPatel, MZeck, RECox, GGBian, HConway, BRPat Beavers, MRybczynski, PJDemarest, KT Heteroaryl-O-glucosides as novel sodium glucose co-transporter 2 inhibitors. Part 1. Bioorg Med Chem Lett 15:5202-6 (2005)  
Target
Name:
Sodium/glucose cotransporter 1
Synonyms:
High affinity sodium-glucose cotransporter Na(+)/glucose cotransporter 1 SGLT1 Sodium-dependent glucose cotransporter 1 (SGLT1) Sodium/glucose cotransporter 1 (SGLT1) | Solute carrier family 5 member 1
Type:
Protein
Mol. Mass.:
73503.78
Organism:
Homo sapiens (Human)
Description:
P13866
Residue:
664
  
Inhibitor
Name:
BDBM50174679
Synonyms:
(2S,3R,4S,5S,6R)-2-(3-(2-(2,3-dihydrobenzofuran-5-yl)ethyl)-1-methyl-1H-indol-4-yloxy)-6-(hydroxymethyl)-tetrahydro-2H-pyran-3,4,5-triol | CHEMBL434175
Type:
Small organic molecule
Emp. Form.:
C25H29NO7
Mol. Mass.:
455.5003
SMILES:
Cn1cc(CCc2ccc3OCCc3c2)c2c(O[C@@H]3O[C@H](CO)[C@@H](O)[C@H](O)[C@H]3O)cccc12
: