Target
Coagulation factor X
Ligand
BDBM50175098
Substrate
Meas. Tech.
ChEMBL_326962 (CHEMBL853297)
IC50
6400±n/a nM
Citation
 Shi, YZhang, JStein, PDShi, MO'Connor, SPBisaha, SNLi, CAtwal, KSBisacchi, GSSitkoff, DPudzianowski, ATLiu, ECHartl, KSSeiler, SMYoussef, SSteinbacher, TESchumacher, WARendina, ARBozarth, JMPeterson, TLZhang, GZahler, R Ketene aminal-based lactam derivatives as a novel class of orally active FXa inhibitors. Bioorg Med Chem Lett 15:5453-8 (2005)  
Target
Name:
Coagulation factor X
Synonyms:
Activated coagulation factor X (FXa) Coagulation factor X precursor F10 Factor X heavy chain Factor Xa Stuart-Prower factor
Type:
Enzyme
Mol. Mass.:
54726.60
Organism:
Homo sapiens (Human)
Description:
Residue:
488
  
Inhibitor
Name:
BDBM50175098
Synonyms:
(S,Z)-3-(1-(m-toluidino)-2-nitrovinylamino)-1-(2-oxo-2-(pyrrolidin-1-yl)ethyl)azepan-2-one | CHEMBL196762
Type:
Small organic molecule
Emp. Form.:
C21H29N5O4
Mol. Mass.:
415.4861
SMILES:
Cc1cccc(NC(C[N+]([O-])=O)=N[C@H]2CCCCN(CC(=O)N3CCCC3)C2=O)c1
: