Target
M-phase inducer phosphatase 3
Ligand
BDBM50175220
Substrate
Meas. Tech.
ChEMBL_328904 (CHEMBL858783)
IC50
12000±n/a nM
Citation
 Lavergne, OFernandes, ACBréhu, LSidhu, ABrézak, MCPrévost, GDucommun, BContour-Galcera, MO Synthesis and biological evaluation of novel heterocyclic quinones as inhibitors of the dual specificity protein phosphatase CDC25C. Bioorg Med Chem Lett 16:171-5 (2005)  
Target
Name:
M-phase inducer phosphatase 3
Synonyms:
CDC25C M-phase inducer phosphatase 3 | MPIP3_HUMAN
Type:
Substrate
Mol. Mass.:
53366.11
Organism:
Homo sapiens (Human)
Description:
P30307
Residue:
473
  
Inhibitor
Name:
BDBM50175220
Synonyms:
5-(2-(dimethylamino)ethylamino)-2-ethyl-1H-benzo[d]imidazole-4,7-dione CHEMBL437898
Type:
Small organic molecule
Emp. Form.:
C13H18N4O2
Mol. Mass.:
262.3076
SMILES:
CCc1nc2c(O)cc(N=CCN(C)C)c(O)c2[nH]1
: