Target
Cyclin-A1/Cyclin-A2/Cyclin-dependent kinase 2
Ligand
BDBM50175237
Substrate
Meas. Tech.
ChEMBL_328341 (CHEMBL864556)
IC50
>20000±n/a nM
Citation
 Akritopoulou-Zanze, IDarczak, DSarris, KPhelan, KMHuth, JRSong, DJohnson, EFJia, YDjuric, SW Scaffold oriented synthesis. Part 1: Design, preparation, and biological evaluation of thienopyrazoles as kinase inhibitors. Bioorg Med Chem Lett 16:96-9 (2005)  
Target
Name:
Cyclin-A1/Cyclin-A2/Cyclin-dependent kinase 2
Synonyms:
CDK2/Cyclin A/Cyclin A1 Cyclin-dependent kinase 2/cyclin A
Type:
Mol. Mass.:
Description:
ASSAY_ID of EBI is 42813
Components:
This complex has 3 components.
Component 1
Name:
Cyclin-A2
Synonyms:
CCN1 CCNA1 CCNA2_HUMAN Cyclin-A
Type:
Enzyme Subunit
Mol. Mass.:
48550.19
Organism:
Homo sapiens (Human)
Description:
P20248
Residue:
432
  
Component 2
Name:
Cyclin-A1
Synonyms:
CCNA1 CDK2/Cyclin A1 Cyclin-A1/Cyclin-dependent kinase 4
Type:
Enzyme
Mol. Mass.:
52343.37
Organism:
Homo sapiens (Human)
Description:
P78396
Residue:
465
  
Component 3
Name:
Cyclin-dependent kinase 2
Synonyms:
CDK2 CDK2_HUMAN Cell division protein kinase 2 Protein cereblon/Cyclin-dependent kinase 2 | p33 protein kinase
Type:
Enzyme Subunit
Mol. Mass.:
33938.17
Organism:
Homo sapiens (Human)
Description:
P24941
Residue:
298
  
Component 4
Name:
Cyclin-A2
Synonyms:
CCN1 CCNA1 CCNA2_HUMAN Cyclin-A
Type:
Enzyme Subunit
Mol. Mass.:
48550.19
Organism:
Homo sapiens (Human)
Description:
P20248
Residue:
432
  
Inhibitor
Name:
BDBM50175237
Synonyms:
CHEMBL199528 | N-butyl-N-methyl-3-phenyl-1H-thieno[2,3-c]pyrazole-5-carboxamide
Type:
Small organic molecule
Emp. Form.:
C17H19N3OS
Mol. Mass.:
313.417
SMILES:
CCCCN(C)C(=O)c1cc2c(n[nH]c2s1)-c1ccccc1
: