Target
RAC-alpha serine/threonine-protein kinase
Ligand
BDBM50175240
Substrate
Meas. Tech.
ChEMBL_328340 (CHEMBL864555)
IC50
>20000±n/a nM
Citation
 Akritopoulou-Zanze, IDarczak, DSarris, KPhelan, KMHuth, JRSong, DJohnson, EFJia, YDjuric, SW Scaffold oriented synthesis. Part 1: Design, preparation, and biological evaluation of thienopyrazoles as kinase inhibitors. Bioorg Med Chem Lett 16:96-9 (2005)  
Target
Name:
RAC-alpha serine/threonine-protein kinase
Synonyms:
AKT phosphorylation (p-AKT) AKT1/PPP1CA C-AKT PKB alpha Protein kinase B Protein kinase B (Akt 1) Protein kinase B alpha Proto-oncogene Akt (Akt1) Proto-oncogene c-Akt (AKT1) RAC-PK-alpha RAC-alpha serine/threonine-protein kinase (AKT1) | RAC-alpha serine/threonine-protein kinase (pAKT)
Type:
Enzyme
Mol. Mass.:
55681.25
Organism:
Homo sapiens (Human)
Description:
P31749
Residue:
480
  
Inhibitor
Name:
BDBM50175240
Synonyms:
CHEMBL199951 | N-cyclohexyl-3-methyl-1H-thieno[2,3-c]pyrazole-5-carboxamide
Type:
Small organic molecule
Emp. Form.:
C13H17N3OS
Mol. Mass.:
263.359
SMILES:
Cc1n[nH]c2sc(cc12)C(=O)NC1CCCCC1
: