Target
Mitogen-activated protein kinase kinase kinase 8
Ligand
BDBM50175237
Substrate
Meas. Tech.
ChEMBL_328344 (CHEMBL864559)
IC50
>20000±n/a nM
Citation
 Akritopoulou-Zanze, IDarczak, DSarris, KPhelan, KMHuth, JRSong, DJohnson, EFJia, YDjuric, SW Scaffold oriented synthesis. Part 1: Design, preparation, and biological evaluation of thienopyrazoles as kinase inhibitors. Bioorg Med Chem Lett 16:96-9 (2005)  
Target
Name:
Mitogen-activated protein kinase kinase kinase 8
Synonyms:
C-COT COT proto-oncogene serine/threonine-protein kinase ESTF MAP3K8 Tumor Progression Loci-2 Kinase (COT) | Tumor progression locus 2
Type:
Serine/threonine-protein kinase
Mol. Mass.:
52916.89
Organism:
Homo sapiens (Human)
Description:
P41279
Residue:
467
  
Inhibitor
Name:
BDBM50175237
Synonyms:
CHEMBL199528 | N-butyl-N-methyl-3-phenyl-1H-thieno[2,3-c]pyrazole-5-carboxamide
Type:
Small organic molecule
Emp. Form.:
C17H19N3OS
Mol. Mass.:
313.417
SMILES:
CCCCN(C)C(=O)c1cc2c(n[nH]c2s1)-c1ccccc1
: